Category : stack-trace

FAILURE: Build failed with an exception. What went wrong: Execution failed for task ‘:app:checkDebugAarMetadata’. Could not resolve all files for configuration ‘:app:debugRuntimeClasspath’. Failed to transform deepar.aar to match attributes {artifactType=android-aar-metadata}. > Execution failed for JetifyTransform: C:UsersHPOneDriveDesktopflutter.pub-cachehostedpub.dartlang.orgcamera_deep_ar-0.0.1androidlibsdeepar.aar. > Failed to transform ‘C:UsersHPOneDriveDesktopflutter.pub-cachehostedpub.dartlang.orgcamera_deep_ar-0.0.1androidlibsdeepar.aar’ using Jetifier. Reason: IllegalArgumentException, message: MALFORMED. (Run with –stacktrace for more details.) Suggestions: – ..

Read more

I am seeing crashes for my react-native app on Google play console. The stack trace for the crash lists the following: – com.facebook.react.common.JavascriptException: TypeError: undefined is not an object (evaluating ‘y.navigate’), stack: [email protected]:1046 [email protected]:2269 [email protected] [email protected]:9693 [email protected] [email protected]:8375 [email protected] [email protected]:5663 [email protected] [email protected]:1197 [email protected]:1340 [email protected]:1394 [email protected]:1692 [email protected]:2482 [email protected] [email protected]:2282 <unknown>@92:13914 [email protected]:88659 [email protected]:13582 [email protected]:13755 [email protected]:14547 [email protected]:3685 <unknown>@31:841 ..

Read more

I’m trying to collect the stacktrace of the target thread. For this purpose,I start a new thread and signal to the target thread in JNI //this is in a new thread while (true) { usleep(100000); syscall(__NR_tgkill, pid, targetThread, SIGPROF); } And then,every time the signal comes,this function is called void signalHandler(int signal, siginfo *info, void ..

Read more

We are using Sentry for error logging. This works fine for real exceptions and crashes but when sending Events I need a Stack trace, too. However, these Events have no StackTrace in the Sentry website. I have set the config options to options.isAttachStacktrace = true options.isAttachThreads = true And my message for sending warnings looks ..

Read more

I was trying to investigate the project build error in the console output as follow: :myapp:processDebugResources FAILED FAILURE: Build failed with an exception. * What went wrong: Execution failed for task ‘:app:processDebugResources’. … … * Try: Run with –stacktrace option to get the stack trace. Run with –info or –debug option to get more log ..

Read more