Category : build

I am building android repo to flash it to a rpi, and arround 80% of the process it failed. this is the log [ 0% 3/6424] build out/target/common/obj/JAVA_LIBRARIES/apache-xml_intermediates/dex-hiddenapi/classes.dex FAILED: out/target/common/obj/JAVA_LIBRARIES/apache-xml_intermediates/dex-hiddenapi/classes.dex /bin/bash -c "(rm -rf out/target/common/obj/JAVA_LIBRARIES/apache-xml_intermediates/dex-hiddenapi/ ) && (mkdir -p out/target/common/obj/JAVA_LIBRARIES/apache-xml_intermediates/dex-hiddenapi/ ) && (find out/target/common/obj/JAVA_LIBRARIES/apache-xml_intermediates/dex/ -maxdepth 1 -name "classes*.dex" | sort | xargs -I{} cp -f ..

Read more

warning: [options] source value 7 is obsolete and will be removed in a future release warning: [options] target value 7 is obsolete and will be removed in a future release warning: [options] To suppress warnings about obsolete options, use -Xlint:-options. error: warnings found and -Werror specified FAILURE: Build failed with an exception. What went wrong: ..

Read more

Hi i’m new to the android studio and android development i get this error when i’m trying to build my project Could not GET ‘https://dl.google.com/dl/android/maven2/androidx/lifecycle/lifecycle-livedata-ktx/2.2.0/lifecycle-livedata-ktx-2.2.0.pom’. Received status code 400 from server: Bad Request Disable Gradle ‘offline mode’ and sync project i have tried to disable gradle’s offline mode based on this stack over flow document ..

Read more

I’m building my Android application with Unity 2019.4.13f1 which usually runs fine, but now I’m getting the following error message when trying to build: More than one file was found with OS independent path ‘billing.properties’ I’ve tried deleting the .aar files in my Assets/Plugins/Android/ and running External Depency Manager/Android/Force Resolve, but I can’t find the ..

Read more

I changed my file build.gradle From: compileSdkVersion 29 minSdkVersion 16 targetSdkVersion 29 To: compileSdkVersion 28 minSdkVersion 18 targetSdkVersion 29 Then get error with message: FAILURE: Build failed with an exception. * What went wrong: Execution failed for task ‘:app:processDebugResources’. > A failure occurred while executing com.android.build.gradle.internal.tasks.Workers$ActionFacade > Android resource linking failed D:DevelopmentProjectsDartFluttertiresbuildlocationintermediateslibrary_manifestdebugAndroidManifest.xml:13:9-17:56: AAPT: error: attribute ..

Read more

Today I was just working on my app and out of a sudden I couldn’t run my app anymore. I keep getting this message: (see screenshot for more info) > Task :app:mergeDebugResources FAILED Execution failed for task ‘:app:mergeDebugResources’. > -1 I hope someone can help me! I have spend the entire day debugging this and ..

Read more