i have problems when i run my flutter application

FAILURE: Build failed with an exception.

  • What went wrong:
    Execution failed for task ‘:app:checkDebugAarMetadata’.

Could not resolve all files for configuration ‘:app:debugRuntimeClasspath’.
Failed to transform deepar.aar to match attributes {artifactType=android-aar-metadata}.
> Execution failed for JetifyTransform: C:UsersHPOneDriveDesktopflutter.pub-cachehostedpub.dartlang.orgcamera_deep_ar-0.0.1androidlibsdeepar.aar.
> Failed to transform ‘C:UsersHPOneDriveDesktopflutter.pub-cachehostedpub.dartlang.orgcamera_deep_ar-0.0.1androidlibsdeepar.aar’ using Jetifier. Reason: IllegalArgumentException, message: MALFORMED. (Run with –stacktrace for more details.)
Suggestions:
– Check out existing issues at https://issuetracker.google.com/issues?q=componentid:460323&s=modified_time:desc, it’s possible that this issue has already been filed there.
– If this issue has not been filed, please report it at https://issuetracker.google.com/issues/new?component=460323 (run with –stacktrace and provide a stack trace if possible).

  • Try:
    Run with –stacktrace option to get the stack trace. Run with –info or –debug option to get more log output. Run with –scan to get full insights.

  • Get more help at https://help.gradle.org

BUILD FAILED in 18s
Exception: Gradle task assembleDebug failed with exit code 1

Source: Android Questions

LEAVE A COMMENT